Reaction Details
TargetCathepsin B
LigandBDBM50354232
Substrate/Competitorn/a
Meas. Tech.ChEMBL_770721 (CHEMBL1837245)
Ki 4500±n/a nM
Citation Sosic, IMirkovic, BTurk, SŠefaneb, BKos, JGobec, S Discovery and kinetic evaluation of 6-substituted 4-benzylthio-1,3,5-triazin-2(1H)-ones as inhibitors of cathepsin B. Eur J Med Chem46:4648-56 (2011) 
 
Cathepsin B
Name:Cathepsin B
Type:Enzyme
Mol. Mass.:37819.69
Organism:Homo sapiens (Human)
Description:gi_63102437
Residue:339
BDBM50354232
NameBDBM50354232
Synonyms:CHEMBL1836470
TypeSmall organic molecule
Emp. Form.C17H14ClN3OS2
Mol. Mass.375.896
SMILESClc1cccc(CSc2nc(SCc3ccccc3)nc(=O)[nH]2)c1