Reaction Details
TargetCarbonic anhydrase 12
LigandBDBM50278108
Substrate/Competitorn/a
Meas. Tech.ChEMBL_770798 (CHEMBL1837603)
Ki 9.4±n/a nM
Citation Morris, JCChiche, JGrellier, CLopez, MBornaghi, LFMaresca, ASupuran, CTPouysségur, JPoulsen, SA Targeting hypoxic tumor cell viability with carbohydrate-based carbonic anhydrase IX and XII inhibitors. J Med Chem54:6905-18 (2011) 
 
Carbonic anhydrase 12
Name:Carbonic anhydrase 12
Type:Enzyme
Mol. Mass.:39456.00
Organism:Homo sapiens (Human)
Description:Catalytic domain of human cloned isozyme was used in the assay
Residue:354
BDBM50278108
NameBDBM50278108
Synonyms:4-(4-{[beta-D-galactopyranosyl]sulfonylmethyl}-1-H-1,2,3-triazol-1-yl)benzenesulfonamide | CHEMBL484530
TypeSmall organic molecule
Emp. Form.C15H20N4O9S2
Mol. Mass.464.471
SMILESNS(=O)(=O)c1ccc(cc1)-n1cc(CS(=O)(=O)[C@@H]2O[C@H](CO)[C@H](O)[C@H](O)[C@H]2O)nn1