Reaction Details
TargetCarbonic anhydrase 2
LigandBDBM50354343
Substrate/Competitorn/a
Meas. Tech.ChEMBL_770796 (CHEMBL1837601)
Ki 49.8±n/a nM
Citation Morris, JCChiche, JGrellier, CLopez, MBornaghi, LFMaresca, ASupuran, CTPouysségur, JPoulsen, SA Targeting hypoxic tumor cell viability with carbohydrate-based carbonic anhydrase IX and XII inhibitors. J Med Chem54:6905-18 (2011) 
 
Carbonic anhydrase 2
Name:Carbonic anhydrase 2
Type:Enzyme
Mol. Mass.:29250.71
Organism:Homo sapiens (Human)
Description:P00918
Residue:260
BDBM50354343
NameBDBM50354343
Synonyms:CHEMBL1836627
TypeSmall organic molecule
Emp. Form.C35H43IN4O21S2
Mol. Mass.1046.765
SMILESCC(=O)OC[C@H]1O[C@H](O[C@@H]2[C@@H](COC(C)=O)O[C@H]([C@H](OC(C)=O)[C@H]2OC(C)=O)S(=O)(=O)Cc2nnn(c2I)-c2ccc(cc2)S(N)(=O)=O)[C@H](OC(C)=O)[C@@H](OC(C)=O)[C@@H]1OC(C)=O