Reaction Details
TargetCarbonic anhydrase 2
LigandBDBM50278783
Substrate/Competitorn/a
Meas. Tech.ChEMBL_770796 (CHEMBL1837601)
Ki 5.3±n/a nM
Citation Morris, JCChiche, JGrellier, CLopez, MBornaghi, LFMaresca, ASupuran, CTPouysségur, JPoulsen, SA Targeting hypoxic tumor cell viability with carbohydrate-based carbonic anhydrase IX and XII inhibitors. J Med Chem54:6905-18 (2011) 
 
Carbonic anhydrase 2
Name:Carbonic anhydrase 2
Type:Enzyme
Mol. Mass.:29250.71
Organism:Homo sapiens (Human)
Description:P00918
Residue:260
BDBM50278783
NameBDBM50278783
Synonyms:4-(4-{[2',3',4',6'-Tetra-O-acetyl-beta-D-galactopyranosyl]sulfonylmethyl}-1-H-1,2,3-triazol-1-yl)benzenesulfonamide | CHEMBL499111
TypeSmall organic molecule
Emp. Form.C23H28N4O13S2
Mol. Mass.632.617
SMILESCC(=O)OC[C@H]1O[C@H]([C@H](OC(C)=O)[C@@H](OC(C)=O)[C@H]1OC(C)=O)S(=O)(=O)Cc1cn(nn1)-c1ccc(cc1)S(N)(=O)=O