Reaction Details
TargetCarbonic anhydrase 1
LigandBDBM50354338
Substrate/Competitorn/a
Meas. Tech.ChEMBL_770795 (CHEMBL1837600)
Ki 142±n/a nM
Citation Morris, JCChiche, JGrellier, CLopez, MBornaghi, LFMaresca, ASupuran, CTPouysségur, JPoulsen, SA Targeting hypoxic tumor cell viability with carbohydrate-based carbonic anhydrase IX and XII inhibitors. J Med Chem54:6905-18 (2011) 
 
Carbonic anhydrase 1
Name:Carbonic anhydrase 1
Type:Enzyme
Mol. Mass.:28873.37
Organism:Homo sapiens (Human)
Description:P00915
Residue:261
BDBM50354338
NameBDBM50354338
Synonyms:CHEMBL1836632
TypeSmall organic molecule
Emp. Form.C21H29IN4O14S2
Mol. Mass.752.508
SMILESNS(=O)(=O)c1ccc(cc1)-n1nnc(CS(=O)(=O)[C@@H]2O[C@H](CO)[C@@H](O[C@H]3O[C@H](CO)[C@@H](O)[C@H](O)[C@H]3O)[C@H](O)[C@H]2O)c1I