Reaction Details
TargetCarbonic anhydrase 1
LigandBDBM50278700
Substrate/Competitorn/a
Meas. Tech.ChEMBL_770795 (CHEMBL1837600)
Ki 91±n/a nM
Citation Morris, JCChiche, JGrellier, CLopez, MBornaghi, LFMaresca, ASupuran, CTPouysségur, JPoulsen, SA Targeting hypoxic tumor cell viability with carbohydrate-based carbonic anhydrase IX and XII inhibitors. J Med Chem54:6905-18 (2011) 
 
Carbonic anhydrase 1
Name:Carbonic anhydrase 1
Type:Enzyme
Mol. Mass.:28873.37
Organism:Homo sapiens (Human)
Description:P00915
Residue:261
BDBM50278700
NameBDBM50278700
Synonyms:4-(4-{[2',3',4',6'-Tetra-O-acetyl-beta-D-glucopyranosyl]thiomethyl}-1-H-1,2,3-triazol-1-yl)benzenesulfonamide | CHEMBL519447
TypeSmall organic molecule
Emp. Form.C23H28N4O11S2
Mol. Mass.600.619
SMILESCC(=O)OC[C@H]1O[C@@H](SCc2cn(nn2)-c2ccc(cc2)S(N)(=O)=O)[C@H](OC(C)=O)[C@@H](OC(C)=O)[C@@H]1OC(C)=O