Reaction Details
TargetCarbonic anhydrase 9
LigandBDBM50354339
Substrate/Competitorn/a
Meas. Tech.ChEMBL_770797 (CHEMBL1837602)
Ki 89±n/a nM
Citation Morris, JCChiche, JGrellier, CLopez, MBornaghi, LFMaresca, ASupuran, CTPouysségur, JPoulsen, SA Targeting hypoxic tumor cell viability with carbohydrate-based carbonic anhydrase IX and XII inhibitors. J Med Chem54:6905-18 (2011) 
 
Carbonic anhydrase 9
Name:Carbonic anhydrase 9
Type:Enzyme
Mol. Mass.:49669.03
Organism:Homo sapiens (Human)
Description:Catalytic domain of human cloned isozyme was used in the assay
Residue:459
BDBM50354339
NameBDBM50354339
Synonyms:CHEMBL1836631
TypeSmall organic molecule
Emp. Form.C15H19IN4O9S2
Mol. Mass.590.367
SMILESNS(=O)(=O)c1ccc(cc1)-n1nnc(CS(=O)(=O)[C@@H]2O[C@H](CO)[C@H](O)[C@H](O)[C@H]2O)c1I