Reaction Details
TargetCarbonic anhydrase 9
LigandBDBM50278846
Substrate/Competitorn/a
Meas. Tech.ChEMBL_770797 (CHEMBL1837602)
Ki 9.5±n/a nM
Citation Morris, JCChiche, JGrellier, CLopez, MBornaghi, LFMaresca, ASupuran, CTPouysségur, JPoulsen, SA Targeting hypoxic tumor cell viability with carbohydrate-based carbonic anhydrase IX and XII inhibitors. J Med Chem54:6905-18 (2011) 
 
Carbonic anhydrase 9
Name:Carbonic anhydrase 9
Type:Enzyme
Mol. Mass.:49669.03
Organism:Homo sapiens (Human)
Description:Catalytic domain of human cloned isozyme was used in the assay
Residue:459
BDBM50278846
NameBDBM50278846
Synonyms:4-(4-(((2S,3R,4S,5S,6R)-3,4,5-trihydroxy-6-(hydroxymethyl)tetrahydro-2H-pyran-2-ylsulfonyl)methyl)-1H-1,2,3-triazol-1-yl)benzenesulfonamide CHEMBL498757
TypeSmall organic molecule
Emp. Form.C15H20N4O9S2
Mol. Mass.464.471
SMILESNS(=O)(=O)c1ccc(cc1)-n1cc(CS(=O)(=O)[C@@H]2O[C@H](CO)[C@@H](O)[C@H](O)[C@H]2O)nn1