Reaction Details
TargetCarbonic anhydrase 9
LigandBDBM50278844
Substrate/Competitorn/a
Meas. Tech.ChEMBL_770797 (CHEMBL1837602)
Ki 257±n/a nM
Citation Morris, JCChiche, JGrellier, CLopez, MBornaghi, LFMaresca, ASupuran, CTPouysségur, JPoulsen, SA Targeting hypoxic tumor cell viability with carbohydrate-based carbonic anhydrase IX and XII inhibitors. J Med Chem54:6905-18 (2011) 
 
Carbonic anhydrase 9
Name:Carbonic anhydrase 9
Type:Enzyme
Mol. Mass.:49669.03
Organism:Homo sapiens (Human)
Description:Catalytic domain of human cloned isozyme was used in the assay
Residue:459
BDBM50278844
NameBDBM50278844
Synonyms:4-(4-{[beta-D-glucopyranosyl]thiomethyl}-1-H-1,2,3-triazol-1-yl)benzenesulfonamide | CHEMBL498750
TypeSmall organic molecule
Emp. Form.C15H20N4O7S2
Mol. Mass.432.472
SMILESNS(=O)(=O)c1ccc(cc1)-n1cc(CS[C@@H]2O[C@H](CO)[C@@H](O)[C@H](O)[C@H]2O)nn1