Reaction Details
TargetCarbonic anhydrase 9
LigandBDBM50354344
Substrate/Competitorn/a
Meas. Tech.ChEMBL_770797 (CHEMBL1837602)
Ki 97±n/a nM
Citation Morris, JCChiche, JGrellier, CLopez, MBornaghi, LFMaresca, ASupuran, CTPouysségur, JPoulsen, SA Targeting hypoxic tumor cell viability with carbohydrate-based carbonic anhydrase IX and XII inhibitors. J Med Chem54:6905-18 (2011) 
 
Carbonic anhydrase 9
Name:Carbonic anhydrase 9
Type:Enzyme
Mol. Mass.:49669.03
Organism:Homo sapiens (Human)
Description:Catalytic domain of human cloned isozyme was used in the assay
Residue:459
BDBM50354344
NameBDBM50354344
Synonyms:CHEMBL1836626
TypeSmall organic molecule
Emp. Form.C23H27IN4O13S2
Mol. Mass.758.514
SMILESCC(=O)OC[C@H]1O[C@H]([C@H](OC(C)=O)[C@@H](OC(C)=O)[C@H]1OC(C)=O)S(=O)(=O)Cc1nnn(c1I)-c1ccc(cc1)S(N)(=O)=O