Reaction Details
TargetCannabinoid receptor 2
LigandBDBM50354474
Substrate/Competitorn/a
Meas. Tech.ChEMBL_771421 (CHEMBL1837181)
Ki 387±n/a nM
Citation Petrov, RRFerrini, MEJaffar, ZThompson, CMRoberts, KDiaz, P Design and evaluation of a novel fluorescent CB2 ligand as probe for receptor visualization in immune cells. Bioorg Med Chem Lett21:5859-62 (2011) 
 
Cannabinoid receptor 2
Name:Cannabinoid receptor 2
Type:G Protein-Coupled Receptor (GPCR)
Mol. Mass.:39690.94
Organism:Homo sapiens (Human)
Description:P34972
Residue:360
BDBM50354474
NameBDBM50354474
Synonyms:CHEMBL1836868
TypeSmall organic molecule
Emp. Form.C23H25N7O6
Mol. Mass.495.4879
SMILESCCCCCN1C(=O)C(=NNC(=O)CN(C)c2ccc([N+]([O-])=O)c3nonc23)c2ccc(OC)cc12