Reaction Details
TargetCorticotropin-releasing factor receptor 1
LigandBDBM50087713
Substrate/Competitorn/a
Meas. Tech.ChEMBL_772056 (CHEMBL1837665)
Ki 1.5±n/a nM
Citation Miller, DCKlute, WBrown, AD Discovery of potent, metabolically stable purine CRF-1 antagonists with differentiated binding kinetic profiles. Bioorg Med Chem Lett21:6108-11 (2011) 
 
Corticotropin-releasing factor receptor 1
Name:Corticotropin-releasing factor receptor 1
Type:Enzyme
Mol. Mass.:50744.31
Organism:Homo sapiens (Human)
Description:P34998
Residue:444
BDBM50087713
NameBDBM50087713
Synonyms:(1-Ethyl-propyl)-[3-(4-methoxy-2-methyl-phenyl)-2,5-dimethyl-pyrazolo[1,5-a]pyrimidin-7-yl]-amine DMP-904 | DMP904
TypeSmall organic molecule
Emp. Form.C21H28N4O
Mol. Mass.352.4732
SMILESCCC(CC)Nc1cc(C)nc2c(c(C)nn12)-c1ccc(OC)cc1C