Reaction Details
TargetCorticotropin-releasing factor receptor 1
LigandBDBM50354981
Substrate/Competitorn/a
Meas. Tech.ChEMBL_772103 (CHEMBL1837869)
Kd 0.373±n/a nM
Citation Miller, DCKlute, WBrown, AD Discovery of potent, metabolically stable purine CRF-1 antagonists with differentiated binding kinetic profiles. Bioorg Med Chem Lett21:6108-11 (2011) 
 
Corticotropin-releasing factor receptor 1
Name:Corticotropin-releasing factor receptor 1
Type:Enzyme
Mol. Mass.:50744.31
Organism:Homo sapiens (Human)
Description:P34998
Residue:444
BDBM50354981
NameBDBM50354981
Synonyms:CHEMBL1836945
TypeSmall organic molecule
Emp. Form.C21H22ClF2N5O
Mol. Mass.433.882
SMILESCc1nc2c(NC(C3CC3)C3CC3)nc(C)nc2n1-c1ccc(OC(F)F)cc1Cl