Reaction Details
TargetVitamin D3 receptor
LigandBDBM50354990
Substrate/Competitorn/a
Meas. Tech.ChEMBL_772109 (CHEMBL1837875)
EC50 0.06±n/a nM
Citation Demizu, YTakahashi, TKaneko, FSato, YOkuda, HOchiai, EHorie, KTakagi, KKakuda, STakimoto-Kamimura, MKurihara, M Design, synthesis and X-ray crystallographic study of new nonsecosteroidal vitamin D receptor ligands. Bioorg Med Chem Lett21:6104-7 (2011) 
 
Vitamin D3 receptor
Name:Vitamin D3 receptor
Type:Protein
Mol. Mass.:48288.72
Organism:Homo sapiens (Human)
Description:P11473
Residue:427
BDBM50354990
NameBDBM50354990
Synonyms:CHEMBL1834893
TypeSmall organic molecule
Emp. Form.C29H44O5
Mol. Mass.472.6567
SMILESCCC(CC)(c1ccc(OC[C@H](O)C(C)(C)C)c(C)c1)c1ccc(O[C@@H](CO)CCO)c(C)c1