Reaction Details
TargetSialidase
LigandBDBM50355214
Substrate/Competitorn/a
Meas. Tech.ChEMBL_772883 (CHEMBL1838286)
Ki 110±n/a nM
Citation Woo, HSKim, DWCurtis-Long, MJLee, BWLee, JHKim, JYKang, JEPark, KH Potent inhibition of bacterial neuraminidase activity by pterocarpans isolated from the roots of Lespedeza bicolor. Bioorg Med Chem Lett21:6100-3 (2011) 
 
Sialidase
Name:Sialidase
Type:PROTEIN
Mol. Mass.:42808.79
Organism:Clostridium perfringens
Description:ChEMBL_991336
Residue:382
BDBM50355214
NameBDBM50355214
Synonyms:CHEMBL401566
TypeSmall organic molecule
Emp. Form.C26H30O5
Mol. Mass.422.5134
SMILES[#6]-[#8]-c1c(-[#6]\[#6]=[#6](\[#6])-[#6])c(-[#8])cc2-[#8]-[#6]-[#6@@H]-3-[#6@@H](-[#8]-c4c-3ccc(-[#8])c4-[#6]\[#6]=[#6](\[#6])-[#6])-c12