Reaction Details
TargetSialidase
LigandBDBM50355213
Substrate/Competitorn/a
Meas. Tech.ChEMBL_772884 (CHEMBL1838287)
IC50 1840±n/a nM
Citation Woo, HSKim, DWCurtis-Long, MJLee, BWLee, JHKim, JYKang, JEPark, KH Potent inhibition of bacterial neuraminidase activity by pterocarpans isolated from the roots of Lespedeza bicolor. Bioorg Med Chem Lett21:6100-3 (2011) 
 
Sialidase
Name:Sialidase
Type:PROTEIN
Mol. Mass.:42808.79
Organism:Clostridium perfringens
Description:ChEMBL_991336
Residue:382
BDBM50355213
NameBDBM50355213
Synonyms:CHEMBL1835792
TypeSmall organic molecule
Emp. Form.C26H30O4
Mol. Mass.406.514
SMILES[#6]\[#6](-[#6])=[#6]\[#6]-c1cc2-[#6]-3-[#8]-c4c(cc(-[#6])c(-[#8])c4-[#6]\[#6]=[#6](\[#6])-[#6])-[#6]-3-[#6]-[#8]-c2cc1-[#8]