Reaction Details
TargetPotassium voltage-gated channel subfamily H member 2
LigandBDBM50355512
Substrate/Competitorn/a
Meas. Tech.ChEMBL_776445 (CHEMBL1913542)
Ki 4400±n/a nM
Citation Chen, ACauchon, EChefson, ADolman, SDucharme, YDubé, DFalgueyret, JPFournier, PAGagné, SGallant, MGrimm, EHan, YHoule, RHuang, JQHughes, GJûteau, HLacombe, PLauzon, SLévesque, JFLiu, SMacdonald, DMackay, BMcKay, DPercival, MDSt-Jacques, RToulmond, S Renin inhibitors for the treatment of hypertension: design and optimization of a novel series of tertiary alcohol-bearing piperidines. Bioorg Med Chem Lett21:3976-81 (2011) 
 
Potassium voltage-gated channel subfamily H member 2
Name:Potassium voltage-gated channel subfamily H member 2
Type:Multi-pass membrane protein
Mol. Mass.:126672.65
Organism:Homo sapiens (Human)
Description:Q12809
Residue:1159
BDBM50355512
NameBDBM50355512
Synonyms:CHEMBL1910314
TypeSmall organic molecule
Emp. Form.C28H29F3N6O2
Mol. Mass.538.5641
SMILESCn1ncnc1Cn1cc(CN(C2CC2)C(=O)[C@H]2CNCC[C@]2(O)c2ccc(F)c(F)c2)c2c(F)cccc12