Reaction Details
TargetRenin
LigandBDBM50355513
Substrate/Competitorn/a
Meas. Tech.ChEMBL_776436 (CHEMBL1913533)
IC50 1.7±n/a nM
Citation Chen, ACauchon, EChefson, ADolman, SDucharme, YDubé, DFalgueyret, JPFournier, PAGagné, SGallant, MGrimm, EHan, YHoule, RHuang, JQHughes, GJûteau, HLacombe, PLauzon, SLévesque, JFLiu, SMacdonald, DMackay, BMcKay, DPercival, MDSt-Jacques, RToulmond, S Renin inhibitors for the treatment of hypertension: design and optimization of a novel series of tertiary alcohol-bearing piperidines. Bioorg Med Chem Lett21:3976-81 (2011) 
 
Renin
Name:Renin
Type:Enzyme
Mol. Mass.:45058.99
Organism:Homo sapiens (Human)
Description:n/a
Residue:406
BDBM50355513
NameBDBM50355513
Synonyms:CHEMBL1910315
TypeSmall organic molecule
Emp. Form.C31H30F3N3O2
Mol. Mass.533.584
SMILESO[C@@]1(CCNC[C@@H]1C(=O)N(Cc1cn(Cc2ccccc2)c2cccc(F)c12)C1CC1)c1ccc(F)c(F)c1