Reaction Details
TargetPotassium voltage-gated channel subfamily H member 2
LigandBDBM50355531
Substrate/Competitorn/a
Meas. Tech.ChEMBL_776445 (CHEMBL1913542)
Ki 1400±n/a nM
Citation Chen, ACauchon, EChefson, ADolman, SDucharme, YDubé, DFalgueyret, JPFournier, PAGagné, SGallant, MGrimm, EHan, YHoule, RHuang, JQHughes, GJûteau, HLacombe, PLauzon, SLévesque, JFLiu, SMacdonald, DMackay, BMcKay, DPercival, MDSt-Jacques, RToulmond, S Renin inhibitors for the treatment of hypertension: design and optimization of a novel series of tertiary alcohol-bearing piperidines. Bioorg Med Chem Lett21:3976-81 (2011) 
 
Potassium voltage-gated channel subfamily H member 2
Name:Potassium voltage-gated channel subfamily H member 2
Type:Multi-pass membrane protein
Mol. Mass.:126672.65
Organism:Homo sapiens (Human)
Description:Q12809
Residue:1159
BDBM50355531
NameBDBM50355531
Synonyms:CHEMBL1910297
TypeSmall organic molecule
Emp. Form.C24H24F3N3O2
Mol. Mass.443.4615
SMILESO[C@@]1(CCNC[C@@H]1C(=O)N(Cc1c[nH]c2cccc(F)c12)C1CC1)c1ccc(F)c(F)c1