Reaction Details
TargetRenin
LigandBDBM50355540
Substrate/Competitorn/a
Meas. Tech.ChEMBL_776436 (CHEMBL1913533)
IC50 2.2±n/a nM
Citation Chen, ACauchon, EChefson, ADolman, SDucharme, YDubé, DFalgueyret, JPFournier, PAGagné, SGallant, MGrimm, EHan, YHoule, RHuang, JQHughes, GJûteau, HLacombe, PLauzon, SLévesque, JFLiu, SMacdonald, DMackay, BMcKay, DPercival, MDSt-Jacques, RToulmond, S Renin inhibitors for the treatment of hypertension: design and optimization of a novel series of tertiary alcohol-bearing piperidines. Bioorg Med Chem Lett21:3976-81 (2011) 
 
Renin
Name:Renin
Type:Enzyme
Mol. Mass.:45058.99
Organism:Homo sapiens (Human)
Description:n/a
Residue:406
BDBM50355540
NameBDBM50355540
Synonyms:CHEMBL1910306
TypeSmall organic molecule
Emp. Form.C32H36F3N5O3
Mol. Mass.595.6551
SMILESCOCCCn1cc(CN(C2CC2)C(=O)[C@H]2CNCC[C@]2(O)c2ccc(F)c(F)c2)c2c(F)ccc(Cn3ccnc3)c12