Reaction Details
TargetMuscarinic acetylcholine receptor M2
LigandBDBM50355612
Substrate/Competitorn/a
Meas. Tech.ChEMBL_776522 (CHEMBL1913619)
Ki 0.056±n/a nM
Citation Glossop, PAWatson, CAPrice, DABunnage, MEMiddleton, DSWood, AJames, KRoberts, DStrang, RSYeadon, MPerros-Huguet, CClarke, NPTrevethick, MAMachin, IStuart, EFEvans, SMHarrison, ACFairman, DAAgoram, BBurrows, JLFeeder, NFulton, CKDillon, BREntwistle, DASpence, FJ Inhalation by design: novel tertiary amine muscarinic M3 receptor antagonists with slow off-rate binding kinetics for inhaled once-daily treatment of chronic obstructive pulmonary disease. J Med Chem54:6888-904 (2011) 
 
Muscarinic acetylcholine receptor M2
Name:Muscarinic acetylcholine receptor M2
Type:GPCR
Mol. Mass.:51730.61
Organism:Homo sapiens (Human)
Description:P08172
Residue:466
BDBM50355612
NameBDBM50355612
Synonyms:CHEMBL1910848
TypeSmall organic molecule
Emp. Form.C28H32N2O2
Mol. Mass.428.5659
SMILESCC(C)(CCC(C(N)=O)(c1ccccc1)c1ccccc1)N1CC(C1)Oc1ccccc1