Reaction Details
TargetMuscarinic acetylcholine receptor M3
LigandBDBM50296345
Substrate/Competitorn/a
Meas. Tech.ChEMBL_776521 (CHEMBL1913618)
Ki 0.075±n/a nM
Citation Glossop, PAWatson, CAPrice, DABunnage, MEMiddleton, DSWood, AJames, KRoberts, DStrang, RSYeadon, MPerros-Huguet, CClarke, NPTrevethick, MAMachin, IStuart, EFEvans, SMHarrison, ACFairman, DAAgoram, BBurrows, JLFeeder, NFulton, CKDillon, BREntwistle, DASpence, FJ Inhalation by design: novel tertiary amine muscarinic M3 receptor antagonists with slow off-rate binding kinetics for inhaled once-daily treatment of chronic obstructive pulmonary disease. J Med Chem54:6888-904 (2011) 
 
Muscarinic acetylcholine receptor M3
Name:Muscarinic acetylcholine receptor M3
Type:Enzyme
Mol. Mass.:66151.03
Organism:Homo sapiens (Human)
Description:P20309
Residue:590
BDBM50296345
NameBDBM50296345
Synonyms:(1R,2R,4S,5R,7S)-7-(2-hydroxy-2,2-di-thiophen-2-yl-acetoxy)-9,9-dimethyl-3-oxa-9-azonia-tricyclo[3.3.1.0*2,4*]nonane bromide Tiotropium Bromide
TypeSmall organic molecule
Emp. Form.C19H22NO4S2
Mol. Mass.392.512
SMILESC[N+]1(C)[C@@H]2C[C@H](C[C@@H]1[C@@H]1O[C@H]21)OC(=O)C(O)(c1cccs1)c1cccs1