Reaction Details
TargetMuscarinic acetylcholine receptor
LigandBDBM50355622
Substrate/Competitorn/a
Meas. Tech.ChEMBL_776531 (CHEMBL1913628)
IC50 1.53±n/a nM
Citation Glossop, PAWatson, CAPrice, DABunnage, MEMiddleton, DSWood, AJames, KRoberts, DStrang, RSYeadon, MPerros-Huguet, CClarke, NPTrevethick, MAMachin, IStuart, EFEvans, SMHarrison, ACFairman, DAAgoram, BBurrows, JLFeeder, NFulton, CKDillon, BREntwistle, DASpence, FJ Inhalation by design: novel tertiary amine muscarinic M3 receptor antagonists with slow off-rate binding kinetics for inhaled once-daily treatment of chronic obstructive pulmonary disease. J Med Chem54:6888-904 (2011) 
 
Muscarinic acetylcholine receptor
Name:Muscarinic acetylcholine receptor
Type:n/a
Mol. Mass.:66272.13
Organism:Cavia porcellus
Description:n/a
Residue:587
BDBM50355622
NameBDBM50355622
Synonyms:CHEMBL1910856
TypeSmall organic molecule
Emp. Form.C28H32N2O3
Mol. Mass.444.5653
SMILESCC(C)(CCC(C(N)=O)(c1ccccc1)c1ccccc1)N1CC(C1)Oc1cccc(O)c1