Reaction Details
TargetGlucocorticoid receptor
LigandBDBM50355721
Substrate/Competitorn/a
Meas. Tech.ChEMBL_776305 (CHEMBL1914150)
Ki 4.2±n/a nM
Citation Weinstein, DSGong, HDoweyko, AMCunningham, MHabte, SWang, JHHolloway, DABurke, CGao, LGuarino, VCarman, JSomerville, JEShuster, DSalter-Cid, LDodd, JHNadler, SGBarrish, JC Azaxanthene based selective glucocorticoid receptor modulators: design, synthesis, and pharmacological evaluation of (S)-4-(5-(1-((1,3,4-thiadiazol-2-yl)amino)-2-methyl-1-oxopropan-2-yl)-5H-chromeno[2,3-b]pyridin-2-yl)-2-fluoro-N,N-dimethylbenzamide (BMS-776532) and its methylene homologue (BMS-791 J Med Chem54:7318-33 (2011) 
 
Glucocorticoid receptor
Name:Glucocorticoid receptor
Type:Enzyme
Mol. Mass.:85656.87
Organism:Homo sapiens (Human)
Description:P04150
Residue:777
BDBM50355721
NameBDBM50355721
Synonyms:CHEMBL1911285
TypeSmall organic molecule
Emp. Form.C26H24N6O3S
Mol. Mass.500.572
SMILESCN(C)C(=O)c1cnc(nc1)-c1ccc2C(c3ccccc3Oc2c1)C(C)(C)C(=O)Nc1nncs1