Reaction Details
TargetIndoleamine 2,3-dioxygenase 1
LigandBDBM50355862
Substrate/Competitorn/a
Meas. Tech.ChEMBL_775234 (CHEMBL1912627)
IC50 19300±n/a nM
Citation Huang, QZheng, MYang, SKuang, CYu, CYang, Q Structure-activity relationship and enzyme kinetic studies on 4-aryl-1H-1,2,3-triazoles as indoleamine 2,3-dioxygenase (IDO) inhibitors. Eur J Med Chem46:5680-7 (2011) 
 
Indoleamine 2,3-dioxygenase 1
Name:Indoleamine 2,3-dioxygenase 1
Type:Enzyme
Mol. Mass.:45330.80
Organism:Homo sapiens (Human)
Description:P14902
Residue:403
BDBM50355862
NameBDBM50355862
Synonyms:CHEMBL1909734
TypeSmall organic molecule
Emp. Form.C8H6ClN3
Mol. Mass.179.606
SMILESClc1ccccc1-c1c[nH]nn1