Reaction Details
TargetPlasminogen
LigandBDBM50355953
Substrate/Competitorn/a
Meas. Tech.ChEMBL_775989 (CHEMBL1912987)
IC50 290000±n/a nM
Citation Teno, NGohda, KWanaka, KSueda, TTsuda, Y Identification of novel plasmin inhibitors possessing nitrile moiety as warhead. Bioorg Med Chem Lett21:6305-9 (2011) 
 
Plasminogen
Name:Plasminogen
Type:Enzyme
Mol. Mass.:90579.18
Organism:Homo sapiens (Human)
Description:n/a
Residue:810
BDBM50355953
NameBDBM50355953
Synonyms:CHEMBL1910422
TypeSmall organic molecule
Emp. Form.C21H35N5O3
Mol. Mass.405.5343
SMILESCC[C@@H](C)[C@@H](N)C(=O)N[C@@H](Cc1ccccc1)C(=O)N[C@@H](CCCCN)C(N)=O