Reaction Details
TargetPlasminogen
LigandBDBM50355954
Substrate/Competitorn/a
Meas. Tech.ChEMBL_775989 (CHEMBL1912987)
IC50 240000±n/a nM
Citation Teno, NGohda, KWanaka, KSueda, TTsuda, Y Identification of novel plasmin inhibitors possessing nitrile moiety as warhead. Bioorg Med Chem Lett21:6305-9 (2011) 
 
Plasminogen
Name:Plasminogen
Type:Enzyme
Mol. Mass.:90579.18
Organism:Homo sapiens (Human)
Description:n/a
Residue:810
BDBM50355954
NameBDBM50355954
Synonyms:CHEMBL1910423
TypeSmall organic molecule
Emp. Form.C19H22N4O2
Mol. Mass.338.4036
SMILESNCCCC[C@H](NC(=O)c1ccc(OCc2ccncc2)cc1)C#N