Reaction Details
TargetPlasminogen
LigandBDBM50355956
Substrate/Competitorn/a
Meas. Tech.ChEMBL_775989 (CHEMBL1912987)
IC50 220000±n/a nM
Citation Teno, NGohda, KWanaka, KSueda, TTsuda, Y Identification of novel plasmin inhibitors possessing nitrile moiety as warhead. Bioorg Med Chem Lett21:6305-9 (2011) 
 
Plasminogen
Name:Plasminogen
Type:Enzyme
Mol. Mass.:90579.18
Organism:Homo sapiens (Human)
Description:n/a
Residue:810
BDBM50355956
NameBDBM50355956
Synonyms:CHEMBL1910638
TypeSmall organic molecule
Emp. Form.C31H31N5O3
Mol. Mass.521.6095
SMILESNCCCC[C@H](NC(=O)c1ccc(OCc2ccncc2)c(NC(=O)Cc2ccc3ccccc3c2)c1)C#N