Reaction Details
TargetPlasma kallikrein
LigandBDBM50355957
Substrate/Competitorn/a
Meas. Tech.ChEMBL_776037 (CHEMBL1912507)
IC50 680000±n/a nM
Citation Teno, NGohda, KWanaka, KSueda, TTsuda, Y Identification of novel plasmin inhibitors possessing nitrile moiety as warhead. Bioorg Med Chem Lett21:6305-9 (2011) 
 
Plasma kallikrein
Name:Plasma kallikrein
Type:Protein
Mol. Mass.:71391.16
Organism:Homo sapiens (Human)
Description:P03952
Residue:638
BDBM50355957
NameBDBM50355957
Synonyms:CHEMBL1910639
TypeSmall organic molecule
Emp. Form.C31H31N5O3
Mol. Mass.521.6095
SMILESNCCCC[C@H](NC(=O)c1ccc(OCc2ccncc2)c(NC(=O)Cc2cccc3ccccc23)c1)C#N