Reaction Details
TargetCannabinoid receptor 1
LigandBDBM21278
Substrate/Competitorn/a
Meas. Tech.ChEMBL_775084 (CHEMBL1912343)
Ki 0.73±n/a nM
Citation Yang, YMiller, KJZhu, YHong, YTian, YMurugesan, NGu, ZO'Tanyi, EKeim, WJRohrbach, KWJohnghar, SBehnia, KPelleymounter, MACarlson, KEEwing, WR Characterization of a novel and selective CB1 antagonist as a radioligand for receptor occupancy studies. Bioorg Med Chem Lett21:6856-60 (2011) 
 
Cannabinoid receptor 1
Name:Cannabinoid receptor 1
Type:G Protein-Coupled Receptor (GPCR)
Mol. Mass.:52868.96
Organism:Homo sapiens (Human)
Description:P21554
Residue:472
BDBM21278
NameBDBM21278
Synonyms:5-(4-chlorophenyl)-1-(2,4-dichlorophenyl)-4-methyl-N-(piperidin-1-yl)-1H-pyrazole-3-carboxamide CHEMBL111 RIMONABANT HYDROCHLORIDE SR 141716A SR141716A [3H]SR141716A
TypeSmall organic molecule
Emp. Form.C22H21Cl3N4O
Mol. Mass.463.787
SMILESCc1c(nn(c1-c1ccc(Cl)cc1)-c1ccc(Cl)cc1Cl)C(=O)NN1CCCCC1