Reaction Details
TargetSphingosine 1-phosphate receptor 5
LigandBDBM50356258
Substrate/Competitorn/a
Meas. Tech.ChEMBL_774921 (CHEMBL1913366)
EC50 34±n/a nM
Citation Urbano, MGuerrero, MVelaparthi, SCrisp, MChase, PHodder, PSchaeffer, MTBrown, SRosen, HRoberts, E Discovery, synthesis and SAR analysis of novel selective small molecule S1P4-R agonists based on a (2Z,5Z)-5-((pyrrol-3-yl)methylene)-3-alkyl-2-(alkylimino)thiazolidin-4-one chemotype. Bioorg Med Chem Lett21:6739-45 (2011) 
 
Sphingosine 1-phosphate receptor 5
Name:Sphingosine 1-phosphate receptor 5
Type:G Protein-Coupled Receptor (GPCR)
Mol. Mass.:41796.42
Organism:Homo sapiens (Human)
Description:n/a
Residue:398
BDBM50356258
NameBDBM50356258
Synonyms:CHEMBL1910689
TypeSmall organic molecule
Emp. Form.C19H19F2N3OS
Mol. Mass.375.435
SMILESC\N=C1/S\C(=C/c2cc(C)n(Cc3c(F)cccc3F)c2C)C(=O)N1C