Reaction Details
TargetSphingosine 1-phosphate receptor 4
LigandBDBM50356269
Substrate/Competitorn/a
Meas. Tech.ChEMBL_774916 (CHEMBL1913361)
EC50 36±n/a nM
Citation Urbano, MGuerrero, MVelaparthi, SCrisp, MChase, PHodder, PSchaeffer, MTBrown, SRosen, HRoberts, E Discovery, synthesis and SAR analysis of novel selective small molecule S1P4-R agonists based on a (2Z,5Z)-5-((pyrrol-3-yl)methylene)-3-alkyl-2-(alkylimino)thiazolidin-4-one chemotype. Bioorg Med Chem Lett21:6739-45 (2011) 
 
Sphingosine 1-phosphate receptor 4
Name:Sphingosine 1-phosphate receptor 4
Type:G Protein-Coupled Receptor (GPCR)
Mol. Mass.:41647.39
Organism:Homo sapiens (Human)
Description:n/a
Residue:384
BDBM50356269
NameBDBM50356269
Synonyms:CHEMBL1910653
TypeSmall organic molecule
Emp. Form.C17H28N3O4P
Mol. Mass.369.3957
SMILESCCCCCCCCc1ccc2nc([nH]c2c1)[C@@H](N)COP(O)(O)=O