Reaction Details
TargetBeta-secretase 1
LigandBDBM50356527
Substrate/Competitorn/a
Meas. Tech.ChEMBL_775964 (CHEMBL1912707)
IC50>10000±n/a nM
Citation Bertini, SAsso, VGhilardi, EGranchi, CManera, CMinutolo, FSaccomanni, GBortolato, AMason, JMoro, SMacchia, M Carbazole-containing arylcarboxamides as BACE1 inhibitors. Bioorg Med Chem Lett21:6657-61 (2011) 
 
Beta-secretase 1
Name:Beta-secretase 1
Type:Protein
Mol. Mass.:55755.10
Organism:Homo sapiens (Human)
Description:P56817
Residue:501
BDBM50356527
NameBDBM50356527
Synonyms:CHEMBL1909688
TypeSmall organic molecule
Emp. Form.C28H23N3O4
Mol. Mass.465.4999
SMILESOC(CN(C(=O)c1ccccc1)c1ccc(cc1)[N+]([O-])=O)Cn1c2ccccc2c2ccccc12