Reaction Details
TargetMatrix metalloproteinase-14
LigandBDBM50356634
Substrate/Competitorn/a
Meas. Tech.ChEMBL_785744 (CHEMBL1920764)
IC50 9330±n/a nM
Citation Neelarapu, RHolzle, DLVelaparthi, SBai, HBrunsteiner, MBlond, SYPetukhov, PA Design, synthesis, docking, and biological evaluation of novel diazide-containing isoxazole- and pyrazole-based histone deacetylase probes. J Med Chem54:4350-64 (2011) 
 
Matrix metalloproteinase-14
Name:Matrix metalloproteinase-14
Type:Protein
Mol. Mass.:65900.19
Organism:Homo sapiens (Human)
Description:P50281
Residue:582
BDBM50356634
NameBDBM50356634
Synonyms:CHEMBL1914702
TypeSmall organic molecule
Emp. Form.C25H26N10O5
Mol. Mass.546.5379
SMILESONC(=O)CCCCCCNC(=O)c1cc(on1)-c1ccc(NC(=O)c2cc(CN=[N+]=[N-])cc(c2)N=[N+]=[N-])cc1