Reaction Details
TargetHistone deacetylase 9
LigandBDBM50356635
Substrate/Competitorn/a
Meas. Tech.ChEMBL_785879 (CHEMBL1921148)
IC50 704±n/a nM
Citation Neelarapu, RHolzle, DLVelaparthi, SBai, HBrunsteiner, MBlond, SYPetukhov, PA Design, synthesis, docking, and biological evaluation of novel diazide-containing isoxazole- and pyrazole-based histone deacetylase probes. J Med Chem54:4350-64 (2011) 
 
Histone deacetylase 9
Name:Histone deacetylase 9
Type:Enzyme
Mol. Mass.:111304.31
Organism:Homo sapiens (Human)
Description:Q9UKV0
Residue:1011
BDBM50356635
NameBDBM50356635
Synonyms:CHEMBL1914708
TypeSmall organic molecule
Emp. Form.C19H24N10O3
Mol. Mass.440.4591
SMILESONC(=O)CCCCCCC(=O)Nc1cnn(Cc2cc(CN=[N+]=[N-])cc(c2)N=[N+]=[N-])c1