Reaction Details
TargetHistone deacetylase 8
LigandBDBM50356638
Substrate/Competitorn/a
Meas. Tech.ChEMBL_785887 (CHEMBL1921156)
IC50 82±n/a nM
Citation Neelarapu, RHolzle, DLVelaparthi, SBai, HBrunsteiner, MBlond, SYPetukhov, PA Design, synthesis, docking, and biological evaluation of novel diazide-containing isoxazole- and pyrazole-based histone deacetylase probes. J Med Chem54:4350-64 (2011) 
 
Histone deacetylase 8
Name:Histone deacetylase 8
Type:Enzyme
Mol. Mass.:41749.60
Organism:Homo sapiens (Human)
Description:Q9BY41
Residue:377
BDBM50356638
NameBDBM50356638
Synonyms:CHEMBL1914704
TypeSmall organic molecule
Emp. Form.C18H23N5O5
Mol. Mass.389.4057
SMILESONC(=O)CCCCCCC(=O)Nc1cnn(Cc2ccc(cc2)[N+]([O-])=O)c1