Reaction Details
TargetHistone deacetylase 8
LigandBDBM50356640
Substrate/Competitorn/a
Meas. Tech.ChEMBL_785887 (CHEMBL1921156)
IC50 147±n/a nM
Citation Neelarapu, RHolzle, DLVelaparthi, SBai, HBrunsteiner, MBlond, SYPetukhov, PA Design, synthesis, docking, and biological evaluation of novel diazide-containing isoxazole- and pyrazole-based histone deacetylase probes. J Med Chem54:4350-64 (2011) 
 
Histone deacetylase 8
Name:Histone deacetylase 8
Type:Enzyme
Mol. Mass.:41749.60
Organism:Homo sapiens (Human)
Description:Q9BY41
Residue:377
BDBM50356640
NameBDBM50356640
Synonyms:CHEMBL1914706
TypeSmall organic molecule
Emp. Form.C23H33N5O5
Mol. Mass.459.5386
SMILESCC(C)(C)OC(=O)Nc1ccc(Cn2cc(NC(=O)CCCCCCC(=O)NO)cn2)cc1