Reaction Details
TargetHistone deacetylase 4
LigandBDBM50356634
Substrate/Competitorn/a
Meas. Tech.ChEMBL_785883 (CHEMBL1921152)
IC50 432±n/a nM
Citation Neelarapu, RHolzle, DLVelaparthi, SBai, HBrunsteiner, MBlond, SYPetukhov, PA Design, synthesis, docking, and biological evaluation of novel diazide-containing isoxazole- and pyrazole-based histone deacetylase probes. J Med Chem54:4350-64 (2011) 
 
Histone deacetylase 4
Name:Histone deacetylase 4
Type:Enzyme
Mol. Mass.:119049.39
Organism:Homo sapiens (Human)
Description:P56524
Residue:1084
BDBM50356634
NameBDBM50356634
Synonyms:CHEMBL1914702
TypeSmall organic molecule
Emp. Form.C25H26N10O5
Mol. Mass.546.5379
SMILESONC(=O)CCCCCCNC(=O)c1cc(on1)-c1ccc(NC(=O)c2cc(CN=[N+]=[N-])cc(c2)N=[N+]=[N-])cc1