Reaction Details
TargetProstaglandin D2 receptor 2
LigandBDBM50356693
Substrate/Competitorn/a
Meas. Tech.ChEMBL_785711 (CHEMBL1920639)
Ki 1.9±n/a nM
Citation Crosignani, SPrêtre, AJorand-Lebrun, CFraboulet, GSeenisamy, JAugustine, JKMissotten, MHumbert, YCleva, CAbla, NDaff, HSchott, OSchneider, MBurgat-Charvillon, FRivron, DHamernig, IArrighi, JFGaudet, MZimmerli, SCJuillard, PJohnson, Z Discovery of potent, selective, and orally bioavailable alkynylphenoxyacetic acid CRTH2 (DP2) receptor antagonists for the treatment of allergic inflammatory diseases. J Med Chem54:7299-317 (2011) 
 
Prostaglandin D2 receptor 2
Name:Prostaglandin D2 receptor 2
Type:Enzyme
Mol. Mass.:43295.45
Organism:Homo sapiens (Human)
Description:Q9Y5Y4
Residue:395
BDBM50356693
NameBDBM50356693
Synonyms:CHEMBL1917608
TypeSmall organic molecule
Emp. Form.C23H24ClNO5S
Mol. Mass.461.958
SMILESCC1CCCCN1S(=O)(=O)c1ccc(C)c(c1)C#Cc1cc(Cl)ccc1OCC(O)=O