Reaction Details
Target72 kDa type IV collagenase
LigandBDBM50356964
Substrate/Competitorn/a
Meas. Tech.ChEMBL_787970 (CHEMBL1918904)
IC50 2.4±n/a nM
Citation Wilson, LJWang, BYang, SMScannevin, RHBurke, SLKarnachi, PRhodes, KJMurray, WV Discovery of novel Cobactin-T based matrix metalloproteinase inhibitors via a ring closing metathesis strategy. Bioorg Med Chem Lett21:6485-90 (2011) 
 
72 kDa type IV collagenase
Name:72 kDa type IV collagenase
Type:Enzyme
Mol. Mass.:73870.36
Organism:Homo sapiens (Human)
Description: P08253
Residue:660
BDBM50356964
NameBDBM50356964
Synonyms:CHEMBL1916215
TypeSmall organic molecule
Emp. Form.C25H29N3O5S2
Mol. Mass.515.645
SMILESCc1ccc(cc1)C#Cc1ccc(s1)S(=O)(=O)N(CCN1CCOCC1)[C@@H]1CC=CCN(O)C1=O