Reaction Details
TargetCollagenase 3
LigandBDBM50356959
Substrate/Competitorn/a
Meas. Tech.ChEMBL_787974 (CHEMBL1918908)
IC50 0.700000±n/a nM
Citation Wilson, LJWang, BYang, SMScannevin, RHBurke, SLKarnachi, PRhodes, KJMurray, WV Discovery of novel Cobactin-T based matrix metalloproteinase inhibitors via a ring closing metathesis strategy. Bioorg Med Chem Lett21:6485-90 (2011) 
 
Collagenase 3
Name:Collagenase 3
Type:Enzyme
Mol. Mass.:53808.06
Organism:Homo sapiens (Human)
Description:P45452
Residue:471
BDBM50356959
NameBDBM50356959
Synonyms:CHEMBL1916210
TypeSmall organic molecule
Emp. Form.C24H28ClN3O6S
Mol. Mass.522.014
SMILESON1CC=CC[C@@H](N(CCN2CCOCC2)S(=O)(=O)c2ccc(Oc3ccc(Cl)cc3)cc2)C1=O