Reaction Details
TargetNeuronal acetylcholine receptor subunit alpha-7
LigandBDBM50357066
Substrate/Competitorn/a
Meas. Tech.ChEMBL_787260 (CHEMBL1918982)
Ki 4500±n/a nM
Citation Bolchi, CGotti, CBinda, MFumagalli, LPucci, LPistillo, FVistoli, GValoti, EPallavicini, M Unichiral 2-(2'-pyrrolidinyl)-1,4-benzodioxanes: the 2R,2'S diastereomer of the N-methyl-7-hydroxy analogue is a potenta4ß2- anda6ß2-nicotinic acetylcholine receptor partial agonist. J Med Chem54:7588-601 (2011) 
 
Neuronal acetylcholine receptor subunit alpha-7
Name:Neuronal acetylcholine receptor subunit alpha-7
Type:Enzyme
Mol. Mass.:56502.44
Organism:Rattus norvegicus (Rat)
Description:Q05941
Residue:502
BDBM50357066
NameBDBM50357066
Synonyms:CHEMBL1917233
TypeSmall organic molecule
Emp. Form.C13H17NO3
Mol. Mass.235.279
SMILESCN1CCC[C@@H]1[C@H]1COc2ccc(O)cc2O1