Reaction Details
TargetProstaglandin D2 receptor 2
LigandBDBM50357144
Substrate/Competitorn/a
Meas. Tech.ChEMBL_787459 (CHEMBL1919378)
IC50 3.5±n/a nM
Citation Luker, TBonnert, RBrough, SCook, ARDickinson, MRDougall, ILogan, CMohammed, RTPaine, SSanganee, HJSargent, CSchmidt, JATeague, SThom, S Substituted indole-1-acetic acids as potent and selective CRTh2 antagonists-discovery of AZD1981. Bioorg Med Chem Lett21:6288-92 (2011) 
 
Prostaglandin D2 receptor 2
Name:Prostaglandin D2 receptor 2
Type:Enzyme
Mol. Mass.:43295.45
Organism:Homo sapiens (Human)
Description:Q9Y5Y4
Residue:395
BDBM50357144
NameBDBM50357144
Synonyms:CHEMBL1917458
TypeSmall organic molecule
Emp. Form.C20H18F3NO5S
Mol. Mass.441.421
SMILESCCS(=O)(=O)c1ccc(Oc2c(C)n(CC(O)=O)c3ccc(cc23)C(F)(F)F)cc1