Reaction Details
TargetProstaglandin D2 receptor 2
LigandBDBM50357136
Substrate/Competitorn/a
Meas. Tech.ChEMBL_787459 (CHEMBL1919378)
IC50 7.9±n/a nM
Citation Luker, TBonnert, RBrough, SCook, ARDickinson, MRDougall, ILogan, CMohammed, RTPaine, SSanganee, HJSargent, CSchmidt, JATeague, SThom, S Substituted indole-1-acetic acids as potent and selective CRTh2 antagonists-discovery of AZD1981. Bioorg Med Chem Lett21:6288-92 (2011) 
 
Prostaglandin D2 receptor 2
Name:Prostaglandin D2 receptor 2
Type:Enzyme
Mol. Mass.:43295.45
Organism:Homo sapiens (Human)
Description:Q9Y5Y4
Residue:395
BDBM50357136
NameBDBM50357136
Synonyms:CHEMBL1917450
TypeSmall organic molecule
Emp. Form.C18H17ClN2O6S2
Mol. Mass.456.92
SMILESCc1c(c2c(NS(C)(=O)=O)cccc2n1CC(O)=O)S(=O)(=O)c1ccc(Cl)cc1