Reaction Details
TargetCytochrome P450 2C9
LigandBDBM50357105
Substrate/Competitorn/a
Meas. Tech.ChEMBL_787469 (CHEMBL1919388)
IC50 5200±n/a nM
Citation Luker, TBonnert, RBrough, SCook, ARDickinson, MRDougall, ILogan, CMohammed, RTPaine, SSanganee, HJSargent, CSchmidt, JATeague, SThom, S Substituted indole-1-acetic acids as potent and selective CRTh2 antagonists-discovery of AZD1981. Bioorg Med Chem Lett21:6288-92 (2011) 
 
Cytochrome P450 2C9
Name:Cytochrome P450 2C9
Type:Enzyme
Mol. Mass.:55636.33
Organism:Homo sapiens (Human)
Description:P11712
Residue:490
BDBM50357105
NameBDBM50357105
Synonyms:CHEMBL1917443
TypeSmall organic molecule
Emp. Form.C19H19NO4S2
Mol. Mass.389.488
SMILESCc1c(Sc2ccc(cc2)S(C)(=O)=O)c2cc(C)ccc2n1CC(O)=O