Reaction Details
TargetSubstance-P receptor
LigandBDBM50357159
Substrate/Competitorn/a
Meas. Tech.ChEMBL_787726 (CHEMBL1918309)
IC50 0.044±n/a nM
Citation Shirai, JYoshikawa, TYamashita, MYamamoto, YKawamoto, MTarui, NKamo, IHashimoto, TIkeura, Y Design, structure-activity relationship, and highly efficient asymmetric synthesis of 3-phenyl-4-benzylaminopiperidine derivatives as novel neurokinin-1 receptor antagonists. Bioorg Med Chem19:6430-46 (2011) 
 
Substance-P receptor
Name:Substance-P receptor
Type:G Protein-Coupled Receptor (GPCR)
Mol. Mass.:46254.43
Organism:Homo sapiens (Human)
Description:P25103
Residue:407
BDBM50357159
NameBDBM50357159
Synonyms:CHEMBL1917856
TypeSmall organic molecule
Emp. Form.C26H30F3N7O2
Mol. Mass.529.5573
SMILESCCNC(=O)N1CC[C@H](NCc2cc(ccc2OC2CC2)-n2nnnc2C(F)(F)F)[C@@H](C1)c1ccccc1