Reaction Details
TargetSubstance-P receptor
LigandBDBM50357184
Substrate/Competitorn/a
Meas. Tech.ChEMBL_787726 (CHEMBL1918309)
IC50 0.054±n/a nM
Citation Shirai, JYoshikawa, TYamashita, MYamamoto, YKawamoto, MTarui, NKamo, IHashimoto, TIkeura, Y Design, structure-activity relationship, and highly efficient asymmetric synthesis of 3-phenyl-4-benzylaminopiperidine derivatives as novel neurokinin-1 receptor antagonists. Bioorg Med Chem19:6430-46 (2011) 
 
Substance-P receptor
Name:Substance-P receptor
Type:G Protein-Coupled Receptor (GPCR)
Mol. Mass.:46254.43
Organism:Homo sapiens (Human)
Description:P25103
Residue:407
BDBM50357184
NameBDBM50357184
Synonyms:CHEMBL1917851
TypeSmall organic molecule
Emp. Form.C23H25F3N6O3
Mol. Mass.490.4782
SMILESCOC(=O)N1CC[C@H](NCc2cc(ccc2OC)-n2nnnc2C(F)(F)F)[C@@H](C1)c1ccccc1