Reaction Details
TargetSubstance-P receptor
LigandBDBM50357185
Substrate/Competitorn/a
Meas. Tech.ChEMBL_787726 (CHEMBL1918309)
IC50 0.049±n/a nM
Citation Shirai, JYoshikawa, TYamashita, MYamamoto, YKawamoto, MTarui, NKamo, IHashimoto, TIkeura, Y Design, structure-activity relationship, and highly efficient asymmetric synthesis of 3-phenyl-4-benzylaminopiperidine derivatives as novel neurokinin-1 receptor antagonists. Bioorg Med Chem19:6430-46 (2011) 
 
Substance-P receptor
Name:Substance-P receptor
Type:G Protein-Coupled Receptor (GPCR)
Mol. Mass.:46254.43
Organism:Homo sapiens (Human)
Description:P25103
Residue:407
BDBM50357185
NameBDBM50357185
Synonyms:CHEMBL1917852
TypeSmall organic molecule
Emp. Form.C23H25F3N6O2
Mol. Mass.474.4788
SMILESCOc1ccc(cc1CN[C@H]1CCN(C[C@H]1c1ccccc1)C(C)=O)-n1nnnc1C(F)(F)F