Reaction Details
TargetG-protein coupled receptor 35
LigandBDBM50357187
Substrate/Competitorn/a
Meas. Tech.ChEMBL_787834 (CHEMBL1918600)
EC50 10200±n/a nM
Citation Deng, HHu, HHe, MHu, JNiu, WFerrie, AMFang, Y Discovery of 2-(4-methylfuran-2(5H)-ylidene)malononitrile and thieno[3,2-b]thiophene-2-carboxylic acid derivatives as G protein-coupled receptor 35 (GPR35) agonists. J Med Chem54:7385-96 (2011) 
 
G-protein coupled receptor 35
Name:G-protein coupled receptor 35
Type:Enzyme Catalytic Domain
Mol. Mass.:34085.57
Organism:Homo sapiens (Human)
Description:gi_33695097
Residue:309
BDBM50357187
NameBDBM50357187
Synonyms:CHEMBL1914576
TypeSmall organic molecule
Emp. Form.C16H9Cl2N3O
Mol. Mass.330.168
SMILES[#6]-[#6]1=[#6](C#N)\[#6](-[#8]C1([#6])c1ccc(Cl)c(Cl)c1)=[#6](\C#N)C#N