Reaction Details
TargetProton-coupled amino acid transporter 1
LigandBDBM24183
Substrate/Competitorn/a
Meas. Tech.ChEMBL_788189 (CHEMBL1919336)
Ki 4000000±n/a nM
Citation Thondorf, IVoigt, VSchäfer, SGebauer, SZebisch, KLaug, LBrandsch, M Three-dimensional quantitative structure-activity relationship analyses of substrates of the human proton-coupled amino acid transporter 1 (hPAT1). Bioorg Med Chem19:6409-18 (2011) 
 
Proton-coupled amino acid transporter 1
Name:Proton-coupled amino acid transporter 1
Type:PROTEIN
Mol. Mass.:53078.06
Organism:Homo sapiens (Human)
Description:ChEMBL_788189
Residue:476
BDBM24183
NameBDBM24183
Synonyms:4-amino-n-[2,3-3H]butyric acid Aminalon GABA [3H]GABA | cid_119
TypeRadiolabeled ligand
Emp. Form.C4H9NO2
Mol. Mass.103.1198
SMILESNCCCC(O)=O